{"text_format":"1","workbook":"xlsx","n_sheets":3,"sheets":["Female","Male","Example"],"not_rendered":{"charts":0,"images":0,"macros":1,"external_links":1,"defined_names":2,"comments":0,"pivot_tables":0},"unopened":[],"bounds":{"document_bytes":16777216,"sheet_cells":100000,"rows_first":2000,"rows_last":500,"rows_between":2000,"halvings":0,"cell_chars":16384,"cell_head_chars":4096},"cells_cut":0,"cells_raw":0,"read":"whole","date_system":"1900"}

{"sheet":"Female","index":0,"n_rows":23,"n_cols":100,"rows_kept":23,"cut":false,"hidden":false,"merged":[]}
[null,"Event","dist(km)","OC",5,6,7,8,9,10,11,12,13,14,15,16,17,18,19,20,21,22,23,24,25,26,27,28,29,30,31,32,33,34,35,36,37,38,39,40,41,42,43,44,45,46,47,48,49,50,51,52,53,54,55,56,57,58,59,60,61,62,63,64,65,66,67,68,69,70,71,72,73,74,75,76,77,78,79,80,81,82,83,84,85,86,87,88,89,90,91,92,93,94,95,96,97,98,99,100]
["F1MileRoad","1MileRoad",1.6093440000000001,253,0.72199999999999998,0.75129999999999997,0.7792,0.80569999999999997,0.83079999999999998,0.85450000000000004,0.87680000000000002,0.89770000000000005,0.91720000000000002,0.93530000000000002,0.95199999999999996,0.96799999999999997,0.98399999999999999,0.996,1,1,1,1,1,1,1,1,1,1,1,1,1,1,1,1,0.99380000000000002,0.99109999999999998,0.98780000000000001,0.98399999999999999,0.97970000000000002,0.9748,0.96950000000000003,0.96360000000000001,0.95730000000000004,0.95040000000000002,0.94299999999999995,0.93510000000000004,0.92659999999999998,0.91769999999999996,0.90820000000000001,0.89849999999999997,0.88880000000000003,0.87909999999999999,0.86939999999999995,0.85970000000000002,0.85,0.84030000000000005,0.8306,0.82089999999999996,0.81110000000000004,0.8014,0.79169999999999996,0.78200000000000003,0.77229999999999999,0.76259999999999994,0.75290000000000001,0.74319999999999997,0.73350000000000004,0.7238,0.71399999999999997,0.70430000000000004,0.6946,0.68489999999999995,0.67520000000000002,0.66549999999999998,0.65580000000000005,0.64610000000000001,0.63639999999999997,0.62670000000000003,0.61680000000000001,0.60619999999999996,0.59460000000000002,0.58209999999999995,0.56859999999999999,0.55420000000000003,0.53879999999999995,0.52249999999999996,0.50529999999999997,0.48709999999999998,0.46800000000000003,0.44800000000000001,0.42699999999999999,0.40510000000000002,0.38219999999999998,0.3584,0.33360000000000001,0.30790000000000001,0.28129999999999999,0.25369999999999998,0.22520000000000001,0.1958]
["F5kmRoad","5kmRoad",5,834,0.69030000000000002,0.72219999999999995,0.75270000000000004,0.78159999999999996,0.80910000000000004,0.83509999999999995,0.85960000000000003,0.88270000000000004,0.9042,0.92430000000000001,0.94330000000000003,0.96220000000000006,0.98109999999999997,0.99529999999999996,1,1,1,1,1,1,1,1,0.99970000000000003,0.999,0.99770000000000003,0.99590000000000001,0.99360000000000004,0.99080000000000001,0.98750000000000004,0.98360000000000003,0.97929999999999995,0.97440000000000004,0.96909999999999996,0.96319999999999995,0.95679999999999998,0.94989999999999997,0.9425,0.93459999999999999,0.92620000000000002,0.91720000000000002,0.90780000000000005,0.89800000000000002,0.88829999999999998,0.87860000000000005,0.86890000000000001,0.85919999999999996,0.84950000000000003,0.83979999999999999,0.83009999999999995,0.82040000000000002,0.81069999999999998,0.80089999999999995,0.79120000000000001,0.78149999999999997,0.77180000000000004,0.7621,0.75239999999999996,0.74270000000000003,0.73299999999999998,0.72330000000000005,0.71360000000000001,0.70379999999999998,0.69410000000000005,0.68440000000000001,0.67469999999999997,0.66500000000000004,0.65529999999999999,0.64559999999999995,0.63590000000000002,0.62619999999999998,0.61650000000000005,0.60670000000000002,0.59699999999999998,0.58679999999999999,0.57579999999999998,0.56399999999999995,0.55149999999999999,0.53820000000000001,0.5242,0.50939999999999996,0.49380000000000002,0.47749999999999998,0.46039999999999998,0.44259999999999999,0.42399999999999999,0.40460000000000002,0.38450000000000001,0.36359999999999998,0.34189999999999998,0.31950000000000001,0.2964,0.27250000000000002,0.24779999999999999,0.2223,0.1961,0.16919999999999999]
["F6kmRoad","6kmRoad",6,1010,0.68889999999999996,0.72119999999999995,0.75190000000000001,0.78100000000000003,0.80859999999999999,0.83460000000000001,0.85899999999999999,0.88190000000000002,0.9032,0.92290000000000005,0.94140000000000001,0.95950000000000002,0.97770000000000001,0.99180000000000001,0.99790000000000001,0.99950000000000006,1,1,1,1,1,1,0.99980000000000002,0.99919999999999998,0.99809999999999999,0.99650000000000005,0.99429999999999996,0.99170000000000003,0.98870000000000002,0.98499999999999999,0.98099999999999998,0.97640000000000005,0.97140000000000004,0.96579999999999999,0.9597,0.95320000000000005,0.94610000000000005,0.93859999999999999,0.93059999999999998,0.92200000000000004,0.91310000000000002,0.90369999999999995,0.89419999999999999,0.88470000000000004,0.875,0.86519999999999997,0.85550000000000004,0.84570000000000001,0.83599999999999997,0.82620000000000005,0.81640000000000001,0.80659999999999998,0.79679999999999995,0.78710000000000002,0.77729999999999999,0.76749999999999996,0.75780000000000003,0.748,0.73829999999999996,0.72850000000000004,0.71870000000000001,0.70889999999999997,0.69910000000000005,0.68940000000000001,0.67959999999999998,0.66979999999999995,0.66010000000000002,0.65029999999999999,0.64059999999999995,0.63080000000000003,0.621,0.61109999999999998,0.60099999999999998,0.59040000000000004,0.57899999999999996,0.56679999999999997,0.55379999999999996,0.54010000000000002,0.52569999999999995,0.51049999999999995,0.4945,0.47770000000000001,0.4602,0.442,0.42299999999999999,0.4032,0.3826,0.36130000000000001,0.3392,0.31640000000000001,0.2928,0.26850000000000002,0.24340000000000001,0.2175,0.19089999999999999,0.16350000000000001]
["F4MileRoad","4MileRoad",6.4373760000000004,1087,0.68840000000000001,0.7208,0.75160000000000005,0.78080000000000005,0.80840000000000001,0.83440000000000003,0.85880000000000001,0.88160000000000005,0.90280000000000005,0.9224,0.94059999999999999,0.95850000000000002,0.97629999999999995,0.99050000000000005,0.99709999999999999,0.99929999999999997,1,1,1,1,1,1,0.99980000000000002,0.99929999999999997,0.99819999999999998,0.99670000000000003,0.99460000000000004,0.99209999999999998,0.98909999999999998,0.98560000000000003,0.98160000000000003,0.97709999999999997,0.97219999999999995,0.96679999999999999,0.96079999999999999,0.95440000000000003,0.94750000000000001,0.94020000000000004,0.93230000000000002,0.92390000000000005,0.91510000000000002,0.90580000000000005,0.89649999999999996,0.88700000000000001,0.87739999999999996,0.86760000000000004,0.85780000000000001,0.84799999999999998,0.83819999999999995,0.82850000000000001,0.81859999999999999,0.80879999999999996,0.79900000000000004,0.78920000000000001,0.77949999999999997,0.76959999999999995,0.75990000000000002,0.75009999999999999,0.74029999999999996,0.73050000000000004,0.72070000000000001,0.71089999999999998,0.70109999999999995,0.69130000000000003,0.68149999999999999,0.67169999999999996,0.66190000000000004,0.65210000000000001,0.64239999999999997,0.63260000000000005,0.62280000000000002,0.61280000000000001,0.60260000000000002,0.59179999999999999,0.58020000000000005,0.56779999999999997,0.55469999999999997,0.54090000000000005,0.52629999999999999,0.51090000000000002,0.49469999999999997,0.4778,0.46010000000000001,0.44180000000000003,0.42259999999999998,0.40260000000000001,0.38190000000000002,0.3604,0.3382,0.31519999999999998,0.29149999999999998,0.26700000000000002,0.2417,0.2157,0.18890000000000001,0.16139999999999999]
["F8kmRoad","8kmRoad",8,1365,0.68669999999999998,0.71960000000000002,0.75070000000000003,0.78010000000000002,0.80779999999999996,0.83389999999999997,0.85809999999999997,0.88070000000000004,0.90159999999999996,0.92079999999999995,0.93840000000000001,0.95530000000000004,0.97219999999999995,0.98629999999999995,0.99460000000000004,0.99860000000000004,1,1,1,1,1,1,0.99990000000000001,0.99950000000000006,0.99860000000000004,0.99729999999999996,0.99550000000000005,0.99319999999999997,0.99060000000000004,0.98729999999999996,0.98360000000000003,0.97950000000000004,0.97489999999999999,0.9698,0.96430000000000005,0.95830000000000004,0.95189999999999997,0.94499999999999995,0.9375,0.92969999999999997,0.9214,0.91259999999999997,0.90359999999999996,0.89429999999999998,0.88460000000000005,0.87480000000000002,0.86499999999999999,0.85509999999999997,0.84519999999999995,0.83540000000000003,0.82550000000000001,0.81559999999999999,0.80569999999999997,0.79590000000000005,0.78600000000000003,0.77610000000000001,0.76629999999999998,0.75639999999999996,0.74660000000000004,0.73670000000000002,0.7268,0.71699999999999997,0.70709999999999995,0.69720000000000004,0.68740000000000001,0.67749999999999999,0.66759999999999997,0.65769999999999995,0.64790000000000003,0.6381,0.62819999999999998,0.61799999999999999,0.60740000000000005,0.59609999999999996,0.58399999999999996,0.57110000000000005,0.5575,0.54310000000000003,0.52810000000000001,0.51219999999999999,0.4955,0.47810000000000002,0.45989999999999998,0.441,0.4214,0.40089999999999998,0.37969999999999998,0.35770000000000002,0.33500000000000002,0.3115,0.28720000000000001,0.26229999999999998,0.23649999999999999,0.21,0.1827,0.15459999999999999]
["F5MileRoad","5MileRoad",8.0467200000000005,1375,0.68669999999999998,0.71950000000000003,0.75070000000000003,0.78010000000000002,0.80779999999999996,0.83389999999999997,0.85809999999999997,0.88070000000000004,0.90159999999999996,0.92069999999999996,0.93830000000000002,0.95520000000000005,0.97209999999999996,0.98619999999999997,0.99450000000000005,0.99860000000000004,1,1,1,1,1,1,0.99990000000000001,0.99950000000000006,0.99870000000000003,0.99729999999999996,0.99550000000000005,0.99329999999999996,0.99060000000000004,0.98740000000000006,0.98370000000000002,0.97950000000000004,0.97499999999999998,0.96989999999999998,0.96440000000000003,0.95840000000000003,0.95199999999999996,0.94510000000000005,0.93769999999999998,0.92979999999999996,0.92149999999999999,0.91279999999999994,0.90380000000000005,0.89449999999999996,0.88480000000000003,0.875,0.86519999999999997,0.85519999999999996,0.84540000000000004,0.83560000000000001,0.82569999999999999,0.81579999999999997,0.80589999999999995,0.79610000000000003,0.78620000000000001,0.77629999999999999,0.76649999999999996,0.75660000000000005,0.74670000000000003,0.7369,0.72699999999999998,0.71709999999999996,0.70720000000000005,0.69740000000000002,0.6875,0.67759999999999998,0.66779999999999995,0.65790000000000004,0.64810000000000001,0.63819999999999999,0.62829999999999997,0.61819999999999997,0.60750000000000004,0.59619999999999995,0.58409999999999995,0.57120000000000004,0.55759999999999998,0.54320000000000002,0.52810000000000001,0.51219999999999999,0.4955,0.47810000000000002,0.45989999999999998,0.441,0.42130000000000001,0.40079999999999999,0.37959999999999999,0.35759999999999997,0.33489999999999998,0.31140000000000001,0.28710000000000002,0.2621,0.23630000000000001,0.20979999999999999,0.1825,0.15440000000000001]
["F10kmRoad","10kmRoad",10,1726,0.68500000000000005,0.71830000000000005,0.74980000000000002,0.77939999999999998,0.80720000000000003,0.83330000000000004,0.85740000000000005,0.87980000000000003,0.90039999999999998,0.91910000000000003,0.93600000000000005,0.95199999999999996,0.96799999999999997,0.98199999999999998,0.99199999999999999,0.998,1,1,1,1,1,1,1,0.99980000000000002,0.99909999999999999,0.998,0.99639999999999995,0.99439999999999995,0.99199999999999999,0.98909999999999998,0.98570000000000002,0.9819,0.97770000000000001,0.97299999999999998,0.96789999999999998,0.96230000000000004,0.95630000000000004,0.94989999999999997,0.94289999999999996,0.93559999999999999,0.92779999999999996,0.91949999999999998,0.91090000000000004,0.90169999999999995,0.8921,0.88219999999999998,0.87229999999999996,0.86229999999999996,0.85240000000000005,0.84250000000000003,0.83250000000000002,0.8226,0.81259999999999999,0.80269999999999997,0.79279999999999995,0.78280000000000005,0.77290000000000003,0.76290000000000002,0.753,0.74309999999999998,0.73309999999999997,0.72319999999999995,0.71319999999999995,0.70330000000000004,0.69340000000000002,0.68340000000000001,0.67349999999999999,0.66349999999999998,0.65359999999999996,0.64370000000000005,0.63370000000000004,0.62339999999999995,0.61229999999999996,0.60050000000000003,0.58789999999999998,0.57450000000000001,0.56040000000000001,0.54549999999999998,0.52990000000000004,0.51349999999999996,0.49630000000000002,0.47839999999999999,0.4597,0.44030000000000002,0.42009999999999997,0.39910000000000001,0.37740000000000001,0.35489999999999999,0.33169999999999999,0.30769999999999997,0.28289999999999998,0.25740000000000002,0.2311,0.2041,0.17630000000000001,0.1477]
{"$rows_left_out":16}
{"sheet":"Male","index":1,"n_rows":23,"n_cols":100,"rows_kept":23,"cut":false,"hidden":false,"merged":[]}
[null,"Event","dist(km)","OC",5,6,7,8,9,10,11,12,13,14,15,16,17,18,19,20,21,22,23,24,25,26,27,28,29,30,31,32,33,34,35,36,37,38,39,40,41,42,43,44,45,46,47,48,49,50,51,52,53,54,55,56,57,58,59,60,61,62,63,64,65,66,67,68,69,70,71,72,73,74,75,76,77,78,79,80,81,82,83,84,85,86,87,88,89,90,91,92,93,94,95,96,97,98,99,100]
["M1MileRoad","1MileRoad",1.6093440000000001,227,0.59899999999999998,0.6502,0.69779999999999998,0.74180000000000001,0.78220000000000001,0.81899999999999995,0.85219999999999996,0.88180000000000003,0.90780000000000005,0.93020000000000003,0.94899999999999995,0.96599999999999997,0.98299999999999998,0.99580000000000002,1,1,1,1,1,1,1,1,1,1,1,0.99770000000000003,0.99129999999999996,0.98440000000000005,0.97740000000000005,0.97050000000000003,0.96360000000000001,0.95660000000000001,0.94969999999999999,0.94269999999999998,0.93579999999999997,0.92889999999999995,0.92190000000000005,0.91500000000000004,0.90800000000000003,0.90110000000000001,0.89419999999999999,0.88719999999999999,0.88029999999999997,0.87329999999999997,0.86639999999999995,0.85950000000000004,0.85250000000000004,0.84560000000000002,0.83860000000000001,0.83169999999999999,0.82479999999999998,0.81779999999999997,0.81089999999999995,0.80389999999999995,0.79700000000000004,0.79010000000000002,0.78310000000000002,0.7762,0.76919999999999999,0.76229999999999998,0.75539999999999996,0.74839999999999995,0.74150000000000005,0.73450000000000004,0.72740000000000005,0.71960000000000002,0.71109999999999995,0.70189999999999997,0.69199999999999995,0.68140000000000001,0.67010000000000003,0.65810000000000002,0.64539999999999997,0.63200000000000001,0.6179,0.60309999999999997,0.58760000000000001,0.57140000000000002,0.55449999999999999,0.53690000000000004,0.51859999999999995,0.49969999999999998,0.48,0.45960000000000001,0.4385,0.4168,0.39429999999999998,0.37109999999999999,0.3473,0.32269999999999999,0.2974,0.27150000000000002,0.24479999999999999,0.2175,0.18940000000000001,0.16070000000000001]
["M5kmRoad","5kmRoad",5,769,0.60799999999999998,0.66639999999999999,0.72,0.76880000000000004,0.81279999999999997,0.85199999999999998,0.88639999999999997,0.91600000000000004,0.94079999999999997,0.96079999999999999,0.97599999999999998,0.98640000000000005,0.99439999999999995,0.99950000000000006,1,1,1,1,1,1,1,1,1,1,1,0.99990000000000001,0.99880000000000002,0.99650000000000005,0.99299999999999999,0.98829999999999996,0.98240000000000005,0.97550000000000003,0.96850000000000003,0.96150000000000002,0.95450000000000002,0.94750000000000001,0.9405,0.9335,0.92649999999999999,0.91949999999999998,0.91249999999999998,0.90549999999999997,0.89849999999999997,0.89149999999999996,0.88449999999999995,0.87749999999999995,0.87050000000000005,0.86350000000000005,0.85650000000000004,0.84950000000000003,0.84250000000000003,0.83550000000000002,0.82850000000000001,0.82150000000000001,0.8145,0.8075,0.80049999999999999,0.79349999999999998,0.78649999999999998,0.77949999999999997,0.77249999999999996,0.76549999999999996,0.75849999999999995,0.75139999999999996,0.74360000000000004,0.73529999999999995,0.72640000000000005,0.71689999999999998,0.70679999999999998,0.69599999999999995,0.68469999999999998,0.67279999999999995,0.6603,0.6472,0.63339999999999996,0.61909999999999998,0.60419999999999996,0.5887,0.5726,0.55579999999999996,0.53849999999999998,0.52059999999999995,0.50209999999999999,0.48299999999999998,0.4632,0.44290000000000002,0.42199999999999999,0.40050000000000002,0.37840000000000001,0.35560000000000003,0.33229999999999998,0.30840000000000001,0.28389999999999999,0.25879999999999997,0.23300000000000001,0.20669999999999999]
["M6kmRoad","6kmRoad",6,930,0.58150000000000002,0.64049999999999996,0.69479999999999997,0.74460000000000004,0.78979999999999995,0.83040000000000003,0.86639999999999995,0.89780000000000004,0.92459999999999998,0.94689999999999996,0.96450000000000002,0.97760000000000002,0.98780000000000001,0.99480000000000002,0.99739999999999995,0.99919999999999998,1,1,1,1,1,1,1,1,1,0.99990000000000001,0.999,0.997,0.99399999999999999,0.9899,0.98460000000000003,0.97850000000000004,0.97209999999999996,0.96550000000000002,0.9587,0.95169999999999999,0.9446,0.9375,0.93030000000000002,0.92320000000000002,0.91610000000000003,0.90890000000000004,0.90180000000000005,0.89470000000000005,0.88759999999999994,0.88039999999999996,0.87329999999999997,0.86619999999999997,0.85899999999999999,0.85189999999999999,0.8448,0.83760000000000001,0.83050000000000002,0.82340000000000002,0.81620000000000004,0.80910000000000004,0.80200000000000005,0.79479999999999995,0.78769999999999996,0.78059999999999996,0.77339999999999998,0.76629999999999998,0.75919999999999999,0.752,0.74429999999999996,0.73619999999999997,0.72760000000000002,0.71830000000000005,0.70850000000000002,0.69789999999999996,0.68679999999999997,0.67510000000000003,0.66279999999999994,0.64980000000000004,0.63619999999999999,0.622,0.60719999999999996,0.59179999999999999,0.57569999999999999,0.55900000000000005,0.54169999999999996,0.52380000000000004,0.50529999999999997,0.48620000000000002,0.46639999999999998,0.44600000000000001,0.42499999999999999,0.40339999999999998,0.38119999999999998,0.35830000000000001,0.33479999999999999,0.31069999999999998,0.28599999999999998,0.26069999999999999,0.23469999999999999,0.20810000000000001]
["M4MileRoad","4MileRoad",6.4373760000000004,1000,0.57130000000000003,0.63049999999999995,0.68510000000000004,0.73529999999999995,0.78090000000000004,0.82199999999999995,0.85870000000000002,0.89080000000000004,0.91839999999999999,0.9415,0.96009999999999995,0.97419999999999995,0.98519999999999996,0.99299999999999999,0.99650000000000005,0.99880000000000002,1,1,1,1,1,1,1,1,1,0.99990000000000001,0.99909999999999999,0.99719999999999998,0.99429999999999996,0.99050000000000005,0.98550000000000004,0.97970000000000002,0.97350000000000003,0.96699999999999997,0.96030000000000004,0.95340000000000003,0.94620000000000004,0.93899999999999995,0.93179999999999996,0.92459999999999998,0.91749999999999998,0.9103,0.90310000000000001,0.89590000000000003,0.88870000000000005,0.88149999999999995,0.87439999999999996,0.86719999999999997,0.86,0.8528,0.84560000000000002,0.83850000000000002,0.83130000000000004,0.82410000000000005,0.81689999999999996,0.80969999999999998,0.80249999999999999,0.7954,0.78820000000000001,0.78100000000000003,0.77380000000000004,0.76659999999999995,0.75939999999999996,0.75219999999999998,0.74450000000000005,0.73650000000000004,0.72799999999999998,0.71889999999999998,0.70909999999999995,0.69869999999999999,0.68769999999999998,0.67600000000000005,0.66369999999999996,0.65080000000000005,0.63729999999999998,0.62309999999999999,0.60840000000000005,0.59299999999999997,0.57689999999999997,0.56020000000000003,0.54300000000000004,0.52510000000000001,0.50649999999999995,0.4874,0.46760000000000002,0.44719999999999999,0.42620000000000002,0.40450000000000003,0.38219999999999998,0.35930000000000001,0.33579999999999999,0.31159999999999999,0.2868,0.26140000000000002,0.23530000000000001,0.2087]
["M8kmRoad","8kmRoad",8,1255,0.53969999999999996,0.59950000000000003,0.65510000000000002,0.70640000000000003,0.75349999999999995,0.79630000000000001,0.83479999999999999,0.86909999999999998,0.89910000000000001,0.92490000000000006,0.94640000000000002,0.96360000000000001,0.97740000000000005,0.98750000000000004,0.99339999999999995,0.99780000000000002,1,1,1,1,1,1,1,1,1,1,0.99929999999999997,0.99790000000000001,0.99550000000000005,0.99229999999999996,0.98819999999999997,0.98319999999999996,0.9778,0.9718,0.96530000000000005,0.95840000000000003,0.95109999999999995,0.94369999999999998,0.93640000000000001,0.92910000000000004,0.92169999999999996,0.91439999999999999,0.90700000000000003,0.89970000000000006,0.89239999999999997,0.88500000000000001,0.87770000000000004,0.87029999999999996,0.86299999999999999,0.85570000000000002,0.84830000000000005,0.84099999999999997,0.8337,0.82630000000000003,0.81899999999999995,0.81159999999999999,0.80430000000000001,0.79700000000000004,0.78959999999999997,0.7823,0.77490000000000003,0.76759999999999995,0.76029999999999998,0.75290000000000001,0.74529999999999996,0.73750000000000004,0.72940000000000005,0.72060000000000002,0.71109999999999995,0.70089999999999997,0.69020000000000004,0.67879999999999996,0.66669999999999996,0.65400000000000003,0.64059999999999995,0.62660000000000005,0.6119,0.59660000000000002,0.58069999999999999,0.56410000000000005,0.54679999999999995,0.52890000000000004,0.51039999999999996,0.49120000000000003,0.4713,0.45079999999999998,0.42970000000000003,0.40799999999999997,0.38550000000000001,0.3624,0.3387,0.31440000000000001,0.2893,0.26369999999999999,0.23730000000000001,0.2104]
["M5MileRoad","5MileRoad",8.0467200000000005,1264,0.53890000000000005,0.59870000000000001,0.65429999999999999,0.7056,0.75270000000000004,0.79559999999999997,0.83420000000000005,0.86850000000000005,0.89859999999999995,0.9244,0.94599999999999995,0.96330000000000005,0.97719999999999996,0.98729999999999996,0.99329999999999996,0.99780000000000002,1,1,1,1,1,1,1,1,1,1,0.99929999999999997,0.99790000000000001,0.99550000000000005,0.99239999999999995,0.98819999999999997,0.98329999999999995,0.97789999999999999,0.97189999999999999,0.96550000000000002,0.95860000000000001,0.95120000000000005,0.94389999999999996,0.9365,0.92920000000000003,0.92179999999999995,0.91449999999999998,0.90710000000000002,0.89980000000000004,0.89249999999999996,0.8851,0.87780000000000002,0.87039999999999995,0.86309999999999998,0.85570000000000002,0.84840000000000004,0.84109999999999996,0.8337,0.82640000000000002,0.81899999999999995,0.81169999999999998,0.80430000000000001,0.79700000000000004,0.78969999999999996,0.7823,0.77500000000000002,0.76759999999999995,0.76029999999999998,0.75290000000000001,0.74529999999999996,0.73760000000000003,0.72940000000000005,0.72060000000000002,0.71109999999999995,0.70099999999999996,0.69030000000000002,0.67879999999999996,0.66679999999999995,0.65410000000000001,0.64070000000000005,0.62670000000000003,0.61199999999999999,0.59670000000000001,0.58079999999999998,0.56420000000000003,0.54690000000000005,0.52900000000000003,0.51049999999999995,0.49130000000000001,0.47139999999999999,0.45090000000000002,0.42980000000000002,0.40810000000000002,0.3856,0.36249999999999999,0.33879999999999999,0.31440000000000001,0.28939999999999999,0.26369999999999999,0.2374,0.2104]
["M10kmRoad","10kmRoad",10,1584,0.50729999999999997,0.56779999999999997,0.62429999999999997,0.67679999999999996,0.72529999999999994,0.76980000000000004,0.81030000000000002,0.8468,0.87929999999999997,0.90780000000000005,0.93230000000000002,0.95279999999999998,0.96930000000000005,0.98180000000000001,0.99029999999999996,0.99680000000000002,1,1,1,1,1,1,1,1,1,1,0.99960000000000004,0.99850000000000005,0.99670000000000003,0.99419999999999997,0.9909,0.9869,0.98219999999999996,0.97670000000000001,0.97050000000000003,0.96360000000000001,0.95609999999999995,0.9486,0.94110000000000005,0.93359999999999999,0.92610000000000003,0.91859999999999997,0.91110000000000002,0.90359999999999996,0.89610000000000001,0.88859999999999995,0.88109999999999999,0.87360000000000004,0.86609999999999998,0.85860000000000003,0.85109999999999997,0.84360000000000002,0.83609999999999995,0.8286,0.82110000000000005,0.81359999999999999,0.80610000000000004,0.79859999999999998,0.79110000000000003,0.78359999999999996,0.77610000000000001,0.76859999999999995,0.7611,0.75360000000000005,0.74609999999999999,0.73860000000000003,0.73080000000000001,0.72230000000000005,0.71309999999999996,0.70330000000000004,0.69279999999999997,0.68159999999999998,0.66969999999999996,0.65720000000000001,0.64400000000000002,0.63009999999999999,0.61560000000000004,0.60040000000000004,0.58450000000000002,0.56799999999999995,0.55079999999999996,0.53290000000000004,0.51429999999999998,0.49509999999999998,0.47520000000000001,0.4546,0.43340000000000001,0.41149999999999998,0.38890000000000002,0.36570000000000003,0.34179999999999999,0.31719999999999998,0.29189999999999999,0.26600000000000001,0.2394,0.21210000000000001]
{"$rows_left_out":16}
{"sheet":"Example","index":2,"n_rows":13,"n_cols":4,"rows_kept":13,"cut":false,"hidden":false,"merged":[]}
["Example",null,null,"Lookup formulae"]
["age",56,null,{"$f":"MATCH(B2,INDIRECT(B$3&\"!E1:CV1\"),0)","v":52}]
["gender","Female",{"$f":"IF(B3=\"Female\",0,1)","v":0}]
["event","10kmRoad",null,{"$f":"MATCH(B$4,INDIRECT(B$3&\"!B2:B23\"),0)","v":7}]
["open standard",{"$f":"AgeStandard(B4,C3)","v":1726},null,{"$f":"OFFSET(INDIRECT(B$3&\"!D1\"),D$4,0)","v":1726}]
["age factor",{"$f":"AgeFactor(B4,B2,C3)","v":0.82260000705718994},null,{"$f":"OFFSET(INDIRECT(B$3&\"!D1\"),D$4,D$2)","v":0.8226}]
[]
["dist(km)",10]
{"$rows_left_out":5}